"Last Name","First Name","Middle Name","Display Name","Competitor Number","Organization","Hometown","Coach",3 Pos Air Rifle Type,3 Pos New Shooter,Course of Fire,"Team","Individual Score","Individual Inner Tens","Team Score","Team Inner Tens","Qualification Score","Qualification Inner Tens","Prone Score","Prone Inner Tens","Standing Score","Standing Inner Tens","Kneeling Score","Kneeling Inner Tens","Final Score","Final Inner Tens","Shoot Off Score","Shoot Off Inner Tens","PR 1 Score","PR 1 Inner Tens","PR 2 Score","PR 2 Inner Tens","ST 1 Score","ST 1 Inner Tens","ST 2 Score","ST 2 Inner Tens","KN 1 Score","KN 1 Inner Tens","KN 2 Score","KN 2 Inner Tens","F 1 Score","F 1 Inner Tens","SO 1 Score","SO 1 Inner Tens",
"Hayes","Deonte","","Hayes, Deonte (244486)","244486","Nation Ford MCJROTC","Fort Mill, SC",,"Sporter","Old Shooter",,Nation Ford A,660.4,29,564,25,564,25,196,12,175,3,193,10,96.4,4,0.0,0,97,4,99,8,86,0,89,3,95,6,98,4,96.4,4,0.0,0,
"Leininger","Sarah","","Leininger, Sarah (266519)","266519","Nation Ford MCJROTC","Fort Mill, SC",,"Sporter","Old Shooter",,Nation Ford A,655.3,27,565,27,565,27,195,11,179,5,191,11,90.3,0,0.0,0,99,6,96,5,91,3,88,2,97,6,94,5,90.3,0,0.0,0,
"Noto","Nick","","Noto, Nick (268958)","268958","Nation Ford MCJROTC","Fort Mill, SC",,"Sporter","Old Shooter",,Nation Ford A,624.1,16,534,16,534,16,193,12,169,2,172,2,90.1,0,0.0,0,97,7,96,5,80,1,89,1,87,1,85,1,90.1,0,0.0,0,
"Burns","Alex","","Burns, Alex (281610)","281610","","Fort Mill, SC",,"Sporter","Old Shooter",,Union County A,602.0,17,523,16,523,16,193,11,159,1,171,4,79.0,1,0.0,0,94,4,99,7,79,0,80,1,88,2,83,2,79.0,1,0.0,0,
"Campbell","Joshua","","Campbell, Joshua (270570)","270570","Nation Ford MCJROTC","Fort Mill, SC",,"Sporter","Old Shooter",,Nation Ford B,645.1,21,548,18,548,18,192,10,176,3,180,5,97.1,3,0.0,0,97,6,95,4,91,3,85,0,90,3,90,2,97.1,3,0.0,0,
"Papadopoulos","Daniel","","Popadapouls Daniel","242327","","Fort Mill, SC",,"Sporter","Old Shooter",,South Iredell A,650.7,22,557,18,557,18,192,9,179,3,186,6,93.7,4,0.0,0,95,3,97,6,92,2,87,1,93,2,93,4,93.7,4,0.0,0,
"Wilson","Ivan","","Wilson, Ivan (331202)","331202","Nation Ford MCJROTC","Fort Mill, SC",,"Sporter","New Shooter",,Nation Ford B,605.7,12,525,12,525,12,192,8,160,3,173,1,80.7,0,0.0,0,98,6,94,2,81,2,79,1,88,1,85,0,80.7,0,0.0,0,
"Sanders","Robert","","Sanders, Robert  (264966)","264966","","Fort Mill, SC",,"Sporter","Old Shooter",,Union County A,638.7,20,552,19,552,19,192,7,171,3,189,9,86.7,1,0.0,0,98,5,94,2,82,1,89,2,94,5,95,4,86.7,1,0.0,0,
"Rasmussen","Jared","","Rasmussen, Jared (294678)","294678","","Fort Mill, SC",,"Sporter","Old Shooter",,Audrey Kell ,532.0,17,532,17,532,17,191,11,164,3,177,3,0.0,0,0.0,0,96,6,95,5,73,0,91,3,88,1,89,2,0.0,0,0.0,0,
"Cameron","Maya","","Cameron, Maya (331188)","331188","","Fort Mill, SC",,"Sporter","New Shooter",,Nation Ford C,602.1,14,521,13,521,13,191,10,158,1,172,2,81.1,1,0.0,0,95,4,96,6,81,1,77,0,86,1,86,1,81.1,1,0.0,0,
"Rivelli","Antonio","","Antonio , Rivelli (294675)","294675","","Fort Mill, SC",,"Sporter","Old Shooter",,Audrey Kell ,602.4,13,515,12,515,12,191,9,154,0,170,3,87.4,1,0.0,0,95,5,96,4,80,0,74,0,90,2,80,1,87.4,1,0.0,0,
"Kalenza","Kayla","","Kalenza, Kayla (296557)","296557","","Fort Mill, SC",,"Sporter","Old Shooter",,Nation Ford A,623.3,16,530,13,530,13,191,8,168,1,171,4,93.3,3,0.0,0,95,3,96,5,82,0,86,1,88,3,83,1,93.3,3,0.0,0,
"Sugg","Ashton","","Sugg, Ashton (266707)","266707","","Fort Mill, SC",,"Sporter","Old Shooter",,Mount Tabor A,610.8,14,526,14,526,14,190,7,157,3,179,4,84.8,0,0.0,0,93,1,97,6,81,2,76,1,92,3,87,1,84.8,0,0.0,0,
"Reibsone","Daniel","","Reibsone, Daniel (270517)","270517","","Fort Mill, SC",,"Sporter","Old Shooter",,South Iredell A,589.6,13,512,13,512,13,189,9,150,1,173,3,77.6,0,0.0,0,95,5,94,4,78,0,72,1,84,1,89,2,77.6,0,0.0,0,
"Adair","Stephen","","Adair, Stephen (331217)","331217","","Fort Mill, SC",,"Sporter","Old Shooter",,,480.0,9,480,9,480,9,189,6,142,1,149,2,0.0,0,0.0,0,94,4,95,2,62,0,80,1,72,0,77,2,0.0,0,0.0,0,
"Carter","Jason","","Carter, Jason (275129)","275129","","Fort Mill, SC",,"Sporter","Old Shooter",,East Gaston A,584.2,5,509,5,509,5,189,4,148,1,172,0,75.2,0,0.0,0,96,3,93,1,74,0,74,1,87,0,85,0,75.2,0,0.0,0,
"Potter","Shea","","Potter, Shea (322760)","322760","","Fort Mill, SC",,"Sporter","New Shooter",,Nation Ford B,595.5,12,513,12,513,12,188,8,151,0,174,4,82.5,0,0.0,0,95,5,93,3,71,0,80,0,85,3,89,1,82.5,0,0.0,0,
"Wickings","Cody","","Wickings, Cody (331199)","331199","","Fort Mill, SC",,"Sporter","Old Shooter",,Nation Ford C,571.1,7,489,7,489,7,186,5,140,0,163,2,82.1,0,0.0,0,92,3,94,2,68,0,72,0,81,2,82,0,82.1,0,0.0,0,
"Foutty","Andrew","","Foutty, Andrew (266709)","266709","","Fort Mill, SC",,"Sporter","Old Shooter",,Mount Tabor A,565.7,7,482,7,482,7,186,3,135,2,161,2,83.7,0,0.0,0,90,0,96,3,66,1,69,1,86,1,75,1,83.7,0,0.0,0,
"Shefmire","Carrie","","Shefmire, Carrie (328303)","328303","","Fort Mill, SC",,"Sporter","Old Shooter",,Nation Ford C,576.1,4,497,4,497,4,186,3,141,0,170,1,79.1,0,0.0,0,94,1,92,2,71,0,70,0,86,1,84,0,79.1,0,0.0,0,
"Channell","Hailey","","Channell, Hailey (331185)","331185","","Fort Mill, SC",,"Sporter","New Shooter",,,487.0,10,487,10,487,10,185,6,149,2,153,2,0.0,0,0.0,0,91,4,94,2,74,0,75,2,75,1,78,1,0.0,0,0.0,0,
"Neal","Jacob","","Neal, Jacob (295064)","295064","","Fort Mill, SC",,"Sporter","Old Shooter",,Nation Ford B,588.7,10,508,9,508,9,184,6,160,3,164,0,80.7,1,0.0,0,92,4,92,2,85,3,75,0,87,0,77,0,80.7,1,0.0,0,
"Ryder","Josh","","Ryder, Josh (273015)","273015","Nation Ford MCJROTC","Fort Mill, SC",,"Sporter","Old Shooter",,,589.0,9,508,8,508,8,184,5,151,1,173,2,81.0,1,0.0,0,96,3,88,2,80,1,71,0,88,1,85,1,81.0,1,0.0,0,
"Brink ","Drew","","Brink , Drew (331181)","331181","Nation Ford MCJROTC","Fort Mill, SC",,"Sporter","New Shooter",,Nation Ford C,580.7,12,501,12,501,12,183,8,160,3,158,1,79.7,0,0.0,0,87,2,96,6,81,1,79,2,79,0,79,1,79.7,0,0.0,0,
"Derenzis","Christian","","Derenzis, Christian (331194)","331194","","Fort Mill, SC",,"Sporter","Old Shooter",,,463.0,7,463,7,463,7,183,5,145,0,135,2,0.0,0,0.0,0,90,2,93,3,76,0,69,0,62,1,73,1,0.0,0,0.0,0,
"Vinson ","Robert","","Vinson , Robert (264682)","264682","","Fort Mill, SC",,"Sporter","Old Shooter",,Union County A,613.6,15,534,15,534,15,182,6,177,7,175,2,79.6,0,0.0,0,90,3,92,3,90,5,87,2,86,1,89,1,79.6,0,0.0,0,
"Stallings","Malcolm","","Stallings, Malcolm (331191)","331191","","Fort Mill, SC",,"Sporter","Old Shooter",,,463.0,6,463,6,463,6,179,4,137,1,147,1,0.0,0,0.0,0,88,0,91,4,72,0,65,1,76,0,71,1,0.0,0,0.0,0,
"Perry","Bryson","","Perry, Bryson (322743)","325428","","Fort Mill, SC",,"Sporter","New Shooter",,Union County B,584.3,11,505,10,505,10,179,4,158,3,168,3,79.3,1,0.0,0,91,3,88,1,83,2,75,1,86,2,82,1,79.3,1,0.0,0,
"Burns","Zachary","","Burns, Zachary (322743)","322743","","Fort Mill, SC",,"Sporter","New Shooter",,Union County B,582.6,11,502,11,502,11,178,4,151,3,173,4,80.6,0,0.0,0,88,2,90,2,77,2,74,1,92,2,81,2,80.6,0,0.0,0,
"Shaver ","Ellie","","Shaver , Ellie (310112)","298727","","Fort Mill, SC",,"Sporter","Old Shooter",,South Iredell B,540.2,5,470,4,470,4,178,2,129,0,163,2,70.2,1,0.0,0,89,1,89,1,63,0,66,0,82,1,81,1,70.2,1,0.0,0,
"Fodel","Connor","","Fodel, Connor (237182)","237182","","Fort Mill, SC",,"Sporter","Old Shooter",,Mount Tabor A,569.2,3,497,3,497,3,178,2,162,1,157,0,72.2,0,0.0,0,90,0,88,2,84,1,78,0,79,0,78,0,72.2,0,0.0,0,
"Hanna ","Brian","","Hanna , Brian (282377)","282377","","Fort Mill, SC",,"Sporter","Old Shooter",,East Gaston A,470.0,3,470,3,470,3,177,2,142,1,151,0,0.0,0,0.0,0,86,0,91,2,74,1,68,0,76,0,75,0,0.0,0,0.0,0,
"Hartsoe","Walker","","Hartsoe, Walker (266710)","266710","","Fort Mill, SC",,"Sporter","Old Shooter",,Mount Tabor A,544.3,4,475,4,475,4,177,2,134,1,164,1,69.3,0,0.0,0,89,0,88,2,61,0,73,1,82,1,82,0,69.3,0,0.0,0,
"Taylor ","Kameron","","Taylor , Kameron (322698)","322698","","Fort Mill, SC",,"Sporter","New Shooter",,Union County B,540.3,7,466,6,466,6,175,3,133,0,158,3,74.3,1,0.0,0,88,0,87,3,63,0,70,0,72,0,86,3,74.3,1,0.0,0,
"Parenti","Victoria","","Parenti, Victoria (236958)","236958","","Fort Mill, SC",,"Sporter","Old Shooter",,Clinton A,449.0,6,449,6,449,6,175,3,122,2,152,1,0.0,0,0.0,0,91,2,84,1,58,1,64,1,72,0,80,1,0.0,0,0.0,0,
"Shoaib","Mohammed","","Shoaib, Mohammed (328377)","328377","","Fort Mill, SC",,"Sporter","New Shooter",,Audrey Kell ,452.0,5,452,5,452,5,175,2,115,2,162,1,0.0,0,0.0,0,83,0,92,2,58,1,57,1,76,0,86,1,0.0,0,0.0,0,
"Shen","Tianyi","","Shen, Tianyi (329704)","329704","","Fort Mill, SC",,"Sporter","New Shooter",,South Iredell A,552.7,4,477,4,477,4,175,2,150,1,152,1,75.7,0,0.0,0,86,1,89,1,77,1,73,0,70,0,82,1,75.7,0,0.0,0,
"Brownell","Arron","","Brownell, Arron (305106)","305106","","Fort Mill, SC",,"Sporter","Old Shooter",,South Iredell A,521.9,2,462,2,462,2,174,1,138,0,150,1,59.9,0,0.0,0,90,0,84,1,72,0,66,0,71,0,79,1,59.9,0,0.0,0,
"Ely","Candice","","Ely, Candice (290693)","290693","","Fort Mill, SC",,"Sporter","Old Shooter",,Lee B,532.7,4,457,4,457,4,173,3,138,0,146,1,75.7,0,0.0,0,83,1,90,2,75,0,63,0,80,1,66,0,75.7,0,0.0,0,
"Compton","Kaylee","","Compton, Kaylee (338416)","338416","","Fort Mill, SC",,"Sporter","New Shooter",,South Iredell B,511.1,4,446,4,446,4,173,2,123,0,150,2,65.1,0,0.0,0,90,1,83,1,60,0,63,0,79,2,71,0,65.1,0,0.0,0,
"Konar ","Kylie","","Konar , Kylie (246118)","246118","","Fort Mill, SC",,"Sporter","Old Shooter",,Providence A,515.6,6,440,6,440,6,172,3,114,0,154,3,75.6,0,0.0,0,84,3,88,0,55,0,59,0,82,1,72,2,75.6,0,0.0,0,
"Young","Chris","","Young, Chris (298065)","298065","","Fort Mill, SC",,"Sporter","Old Shooter",,,530.0,4,462,3,462,3,172,1,154,2,136,0,68.0,1,0.0,0,88,0,84,1,76,1,78,1,72,0,64,0,68.0,1,0.0,0,
"Faivre","Arimus","","Faivre, Arimus (328299)","328299","","Fort Mill, SC",,"Sporter","New Shooter",,,487.1,4,415,4,415,4,171,4,122,0,122,0,72.1,0,0.0,0,87,2,84,2,64,0,58,0,57,0,65,0,72.1,0,0.0,0,
"Winchester","Nicholas","","Winchester, Nicholas (329404)","329404","","Fort Mill, SC",,"Sporter","New Shooter",,East Gaston B,419.0,4,419,4,419,4,171,3,106,0,142,1,0.0,0,0.0,0,85,1,86,2,50,0,56,0,70,0,72,1,0.0,0,0.0,0,
"Zervos","Nicholas","","Zervos, Nicholas (331198)","331198","","Fort Mill, SC",,"Sporter","New Shooter",,,519.0,2,444,2,444,2,171,2,136,0,137,0,75.0,0,0.0,0,86,1,85,1,62,0,74,0,76,0,61,0,75.0,0,0.0,0,
"Hutchinson","Benjamin","","Hutchinson, Ben (331195)","331195","","Fort Mill, SC",,"Sporter","New Shooter",,,424.0,4,424,4,424,4,170,3,115,0,139,1,0.0,0,0.0,0,90,3,80,0,59,0,56,0,74,1,65,0,0.0,0,0.0,0,
"Lavigne","Gabriel","","Lavigne, Gabe (302201)","302201","","Fort Mill, SC",,"Sporter","Old Shooter",,,458.0,2,458,2,458,2,170,1,142,0,146,1,0.0,0,0.0,0,83,0,87,1,64,0,78,0,72,0,74,1,0.0,0,0.0,0,
"Johnson","Amanda","","Johnson, Amanda 323240 (323240)","323240","","Fort Mill, SC",,"Sporter","New Shooter",,Lee A,532.3,11,455,10,455,10,169,5,136,2,150,3,77.3,1,0.0,0,86,1,83,4,59,0,77,2,77,2,73,1,77.3,1,0.0,0,
"Garner","Gregory","","Garner, Gregory (325407)","325407","","Fort Mill, SC",,"Sporter","New Shooter",,Union County B,517.7,4,438,3,438,3,169,2,137,1,132,0,79.7,1,0.0,0,80,1,89,1,73,1,64,0,75,0,57,0,79.7,1,0.0,0,
"Fisher","Aurora","","Aurora, Fisher (340081)","340081","","Fort Mill, SC",,"Sporter","New Shooter",,East Gaston C,398.0,4,398,4,398,4,169,2,94,0,135,2,0.0,0,0.0,0,84,1,85,1,42,0,52,0,61,0,74,2,0.0,0,0.0,0,
"Isgett","Kenneth","","Isgett, Kenneth (329408)","329408","","Fort Mill, SC",,"Sporter","New Shooter",,East Gaston B,419.0,3,419,3,419,3,167,2,144,0,108,1,0.0,0,0.0,0,82,1,85,1,75,0,69,0,62,1,46,0,0.0,0,0.0,0,
"Harbst","Jacob","","Harbst, Jacob (322700)","322700","","Fort Mill, SC",,"Sporter","New Shooter",,Union County A,570.1,8,493,7,493,7,167,2,147,2,179,3,77.1,1,0.0,0,86,1,81,1,83,2,64,0,95,2,84,1,77.1,1,0.0,0,
"Skyler","Coleman","","Coleman, Skyler (339912)","341266","","Fort Mill, SC",,"Sporter","New Shooter",,Audrey Kell ,501.7,2,421,2,421,2,164,0,112,2,145,0,80.7,0,0.0,0,82,0,82,0,61,2,51,0,75,0,70,0,80.7,0,0.0,0,
"Abbinate","Adian","","Abbinate, Adian (276532)","276532","","Fort Mill, SC",,"Sporter","Old Shooter",,Providence A,503.4,2,436,2,436,2,161,1,124,0,151,1,67.4,0,0.0,0,79,0,82,1,58,0,66,0,72,1,79,0,67.4,0,0.0,0,
"Cook","Devin","","Cook, Devin (244481)","244481","Nation Ford MCJROTC","Fort Mill, SC",,"Sporter","Old Shooter",,,400.0,1,400,1,400,1,161,1,102,0,137,0,0.0,0,0.0,0,81,1,80,0,53,0,49,0,58,0,79,0,0.0,0,0.0,0,
"Hines","Sean","","Hines, Sean (246119)","246119","","Fort Mill, SC",,"Sporter","Old Shooter",,Providence A,449.6,2,383,2,383,2,161,0,110,2,112,0,66.6,0,0.0,0,82,0,79,0,63,1,47,1,54,0,58,0,66.6,0,0.0,0,
"Levy","William","","Levy, William (270726)","270726","Nation Ford MCJROTC","Fort Mill, SC",,"Sporter","Old Shooter",,,426.0,2,426,2,426,2,159,1,117,0,150,1,0.0,0,0.0,0,76,0,83,1,60,0,57,0,73,1,77,0,0.0,0,0.0,0,
"Phillips","Sydni","","Phillips, Sydni (323226)","323226","","Fort Mill, SC",,"Sporter","New Shooter",,Lee B,505.2,3,447,3,447,3,159,0,145,1,143,2,58.2,0,0.0,0,78,0,81,0,75,0,70,1,65,0,78,2,58.2,0,0.0,0,
"Neuenschwander","Tristian","","Nevenswander, Tristian (307289)","307289","","Fort Mill, SC",,"Sporter","Old Shooter",,Providence A,407.2,6,373,6,373,6,158,3,79,1,136,2,34.2,0,0.0,0,77,2,81,1,35,0,44,1,66,2,70,0,34.2,0,0.0,0,
"Hurst","Makayla","","Hurst,Makayla  (103)","340084","","Fort Mill, SC",,"Sporter","New Shooter",,East Gaston C,422.0,5,422,5,422,5,156,2,127,2,139,1,0.0,0,0.0,0,77,1,79,1,58,0,69,2,69,1,70,0,0.0,0,0.0,0,
"Miles","Ben","","Miles, Ben (302204)","302204","","Fort Mill, SC",,"Sporter","Old Shooter",,,492.8,3,420,3,420,3,155,3,136,0,129,0,72.8,0,0.0,0,71,1,84,2,76,0,60,0,71,0,58,0,72.8,0,0.0,0,
"Hendricks","William","","Hendricks, William (310112)","310112","","Fort Mill, SC",,"Sporter","Old Shooter",,South Iredell B,365.9,1,326,1,326,1,151,1,56,0,119,0,39.9,0,0.0,0,83,0,68,1,17,0,39,0,68,0,51,0,39.9,0,0.0,0,
"Pattinson","Devon","","Pattinson, Devon (331183)","331183","","Fort Mill, SC",,"Sporter","Old Shooter",,,319.0,1,319,1,319,1,148,0,58,1,113,0,0.0,0,0.0,0,74,0,74,0,16,1,42,0,58,0,55,0,0.0,0,0.0,0,
"McGady","Trevor","","McGady, Trevor (270725)","270725","Nation Ford MCJROTC","Fort Mill, SC",,"Sporter","Old Shooter",,,386.0,2,386,2,386,2,147,2,123,0,116,0,0.0,0,0.0,0,59,0,88,2,66,0,57,0,61,0,55,0,0.0,0,0.0,0,
"Hinson","Allie ","","Hanson, Allie ","329403","","Fort Mill, SC",,"Sporter","New Shooter",,East Gaston A,496.3,4,423,3,423,3,147,2,136,1,140,0,73.3,1,0.0,0,76,2,71,0,76,1,60,0,74,0,66,0,73.3,1,0.0,0,
"Brown","Roy","","Brown, Roy (322762)","322762","","Fort Mill, SC",,"Sporter","New Shooter",,,245.0,3,245,3,245,3,144,3,101,0,0,0,0.0,0,0.0,0,69,1,75,2,57,0,44,0,0,0,0,0,0.0,0,0.0,0,
"Nicholson","Jason","","Nicholson, Jason (340083)","340083","","Fort Mill, SC",,"Sporter","New Shooter",,East Gaston C,284.0,2,284,2,284,2,144,2,52,0,88,0,0.0,0,0.0,0,72,2,72,0,28,0,24,0,53,0,35,0,0.0,0,0.0,0,
"Davis","Max","","Davis, Max (340080)","340080","","Fort Mill, SC",,"Sporter","New Shooter",,East Gaston B,354.0,3,354,3,354,3,143,2,72,0,139,1,0.0,0,0.0,0,73,0,70,2,30,0,42,0,66,0,73,1,0.0,0,0.0,0,
"Schwamb","Jordan","","Schwamb, Jordan (302208)","302208","Nation Ford MCJROTC","Fort Mill, SC",,"Sporter","Old Shooter",,,370.0,0,370,0,370,0,143,0,89,0,138,0,0.0,0,0.0,0,74,0,69,0,32,0,57,0,70,0,68,0,0.0,0,0.0,0,
"Clark","James","","Clark, James (340054)","340054","","Fort Mill, SC",,"Sporter","New Shooter",,Clinton A,379.0,4,379,4,379,4,142,2,107,1,130,1,0.0,0,0.0,0,76,1,66,1,46,0,61,1,66,1,64,0,0.0,0,0.0,0,
"Intemann","Caeden","","Intemann, Caeden (302199)","302199","","Fort Mill, SC",,"Sporter","Old Shooter",,,364.5,3,326,3,326,3,136,1,82,1,108,1,38.5,0,0.0,0,61,0,75,1,39,1,43,0,48,0,60,1,38.5,0,0.0,0,
"Jones","Javon","","Jones, Javon (325678)","325678","","Fort Mill, SC",,"Sporter","New Shooter",,Clinton A,293.0,1,293,1,293,1,135,1,96,0,62,0,0.0,0,0.0,0,64,0,71,1,49,0,47,0,28,0,34,0,0.0,0,0.0,0,
"Short ","John","","Short , John (270622)","270622","Nation Ford MCJROTC","Fort Mill, SC",,"Sporter","Old Shooter",,,396.3,0,334,0,334,0,135,0,111,0,88,0,62.3,0,0.0,0,63,0,72,0,58,0,53,0,42,0,46,0,62.3,0,0.0,0,
"Hiner","Andrew","","Hiner, Andrew (270607)","270607","Nation Ford MCJROTC","Fort Mill, SC",,"Sporter","Old Shooter",,,282.0,0,282,0,282,0,133,0,45,0,104,0,0.0,0,0.0,0,64,0,69,0,45,0,0,0,64,0,40,0,0.0,0,0.0,0,
"Britt","Morgan","","Britt, Morgan (300058)","300058","","Fort Mill, SC",,"Sporter","Old Shooter",,Lee B,347.2,0,305,0,305,0,131,0,72,0,102,0,42.2,0,0.0,0,66,0,65,0,38,0,34,0,43,0,59,0,42.2,0,0.0,0,
"Luczynski","Jessica","","Luczynski, Jessica (302202)","302202","","Fort Mill, SC",,"Sporter","Old Shooter",,,314.0,0,314,0,314,0,130,0,59,0,125,0,0.0,0,0.0,0,69,0,61,0,36,0,23,0,64,0,61,0,0.0,0,0.0,0,
"Cook","Nicholas","","Cook, Nicholas (340085)","340085","","Fort Mill, SC",,"Sporter","New Shooter",,East Gaston C,275.0,1,275,1,275,1,125,0,55,0,95,1,0.0,0,0.0,0,71,0,54,0,12,0,43,0,45,0,50,1,0.0,0,0.0,0,
"Daniel","Dennis","","Daniel, Dennis (302193)","302193","","Fort Mill, SC",,"Sporter","Old Shooter",,,247.0,1,247,1,247,1,123,0,65,1,59,0,0.0,0,0.0,0,67,0,56,0,37,1,28,0,32,0,27,0,0.0,0,0.0,0,
"Barnette","Jaden","","Barnette, Jaden (323235)","323235","","Fort Mill, SC",,"Sporter","New Shooter",,Lee A,314.2,0,260,0,260,0,122,0,81,0,57,0,54.2,0,0.0,0,65,0,57,0,43,0,38,0,34,0,23,0,54.2,0,0.0,0,
"Frattaroli","Anthony","","Frattaroli, Anthony (270778)","270778","Nation Ford MCJROTC","Fort Mill, SC",,"Sporter","Old Shooter",,,358.0,2,358,2,358,2,121,1,116,1,121,0,0.0,0,0.0,0,75,0,46,1,59,0,57,1,66,0,55,0,0.0,0,0.0,0,
"Shaffery","Benjamin","","Shaffery, Ben  (331255)","331255","","Fort Mill, SC",,"Sporter","Old Shooter",,,201.0,0,201,0,201,0,121,0,39,0,41,0,0.0,0,0.0,0,48,0,73,0,39,0,0,0,20,0,21,0,0.0,0,0.0,0,
"Patrick","Zachary","","Patrick, Zachary (329552)","329552","","Fort Mill, SC",,"Sporter","New Shooter",,Mount Tabor B,310.5,0,266,0,266,0,120,0,60,0,86,0,44.5,0,0.0,0,74,0,46,0,43,0,17,0,40,0,46,0,44.5,0,0.0,0,
"Taylor","Tony","","Taylor, Tony (244474)","244474","Nation Ford MCJROTC","Fort Mill, SC",,"Sporter","Old Shooter",,,321.0,0,321,0,321,0,119,0,82,0,120,0,0.0,0,0.0,0,70,0,49,0,30,0,52,0,53,0,67,0,0.0,0,0.0,0,
"Tritt","Brady","","Tritt, Brady (290700)","290700","","Fort Mill, SC",,"Sporter","New Shooter",,Lee A,300.2,0,261,0,261,0,117,0,90,0,54,0,39.2,0,0.0,0,65,0,52,0,45,0,45,0,34,0,20,0,39.2,0,0.0,0,
"Rogers","Jacob","","Rogers, Jacob (331209)","331209","","Fort Mill, SC",,"Sporter","New Shooter",,,225.0,0,225,0,225,0,116,0,56,0,53,0,0.0,0,0.0,0,64,0,52,0,24,0,32,0,51,0,2,0,0.0,0,0.0,0,
"Krebs","Matthew","","Krebs, Matthew (270776)","270776","Nation Ford MCJROTC","Fort Mill, SC",,"Sporter","Old Shooter",,,316.0,0,316,0,316,0,113,0,92,0,111,0,0.0,0,0.0,0,50,0,63,0,50,0,42,0,55,0,56,0,0.0,0,0.0,0,
"Osborne","Carolina","","Osborne, Carolina (338181)","338181","","Fort Mill, SC",,"Sporter","New Shooter",,Lee B,330.6,2,267,1,267,1,112,1,76,0,79,0,63.6,1,0.0,0,64,0,48,1,38,0,38,0,50,0,29,0,63.6,1,0.0,0,
"Gallo","Natalie","","Gallo, Natalie (270717)","270717","Nation Ford MCJROTC","Fort Mill, SC",,"Sporter","Old Shooter",,,281.0,0,281,0,281,0,107,0,85,0,89,0,0.0,0,0.0,0,58,0,49,0,43,0,42,0,54,0,35,0,0.0,0,0.0,0,
"Johnson","David","","Johnson, David (329549)","329549","","Fort Mill, SC",,"Sporter","Old Shooter",,Mount Tabor B,266.0,2,266,2,266,2,102,1,80,0,84,1,0.0,0,0.0,0,58,1,44,0,49,0,31,0,37,0,47,1,0.0,0,0.0,0,
"Hager","Pierce","","Hager, Pierce (329398)","329398","","Fort Mill, SC",,"Sporter","New Shooter",,East Gaston B,251.0,0,251,0,251,0,102,0,47,0,102,0,0.0,0,0.0,0,54,0,48,0,8,0,39,0,47,0,55,0,0.0,0,0.0,0,
"Gatlin","Savannah","","Gatlin, Savannah (326891)","326891","","Fort Mill, SC",,"Sporter","New Shooter",,Lee A,321.5,0,272,0,272,0,99,0,76,0,97,0,49.5,0,0.0,0,46,0,53,0,34,0,42,0,48,0,49,0,49.5,0,0.0,0,
"Sasser","McCaulley","","Sasser, McCaulley (325674)","325674","","Fort Mill, SC",,"Sporter","New Shooter",,Clinton A,237.0,3,237,3,237,3,98,1,68,1,71,1,0.0,0,0.0,0,48,0,50,1,28,0,40,1,42,1,29,0,0.0,0,0.0,0,
"Collins","Lydnsie","","Collins, Lydnsie (302215)","302215","","Fort Mill, SC",,"Sporter","Old Shooter",,,346.0,1,346,1,346,1,85,0,136,1,125,0,0.0,0,0.0,0,39,0,46,0,73,1,63,0,72,0,53,0,0.0,0,0.0,0,
"Yzquierdo","Joely","","Yzquierdo, Joely (244535)","244535","Nation Ford MCJROTC","Fort Mill, SC",,"Sporter","Old Shooter",,,153.0,1,153,1,153,1,81,1,36,0,36,0,0.0,0,0.0,0,35,0,46,1,16,0,20,0,33,0,3,0,0.0,0,0.0,0,
"Wright","Deandre","","Wright, De'andre (331254)","331254","","Fort Mill, SC",,"Sporter","Old Shooter",,,142.0,0,142,0,142,0,66,0,0,0,76,0,0.0,0,0.0,0,41,0,25,0,0,0,0,0,47,0,29,0,0.0,0,0.0,0,